{"text_format":"1","workbook":"xlsx","n_sheets":32,"sheets":["Home Page","Tool Management","Info Button Text","Starting The Process","Hospital Information","Summary","Emer Mgmt and Surge Cap","Summary Raw","Critical Care","ED","Medical Services","Mental Health","OBGYN and Nursery","Pediatrics","Renal","Surgical Services","Blood Bank","Facilities_Utilities","Infection Prev and Cont","IT_Communications","Lab","Nutrition Services","Pharmacy","Radiology","Resp Care_Bioelectronics","Safety and Security","Sterile Supply","Storeroom","Transportation","Pharmacy Supplies","Storeroom Supplies","Codes"],"not_rendered":{"charts":0,"images":0,"macros":1,"external_links":0,"defined_names":34,"comments":0,"pivot_tables":0},"unopened":[],"bounds":{"document_bytes":16777216,"sheet_cells":100000,"rows_first":2000,"rows_last":500,"rows_between":2000,"halvings":0,"cell_chars":16384,"cell_head_chars":4096},"cells_cut":0,"cells_raw":0,"read":"whole","date_system":"1900"}

{"sheet":"Home Page","index":0,"n_rows":31,"n_cols":4,"rows_kept":31,"cut":false,"hidden":false,"merged":[[30,3,30,12],[2,2,2,13],[5,3,5,12],[12,3,12,12],[14,3,14,12],[20,3,20,12]]}
[]
[]
[null,null,"Hospital Resource Vulnerability Assessment (RVA)"]
[]
[]
[null,null,null,"Background and Instructions for Emergency Manager"]
[]
[]
[]
[]
{"$rows_left_out":22}
{"sheet":"Tool Management","index":1,"n_rows":3,"n_cols":3,"rows_kept":3,"cut":false,"hidden":false,"merged":[[2,2,2,8]]}
[]
[]
[null,null,"Tool Management"]

{"sheet":"Info Button Text","index":2,"n_rows":405,"n_cols":5,"rows_kept":405,"cut":false,"hidden":true,"merged":[]}
["Sheet","Category","Button","Info Button Text"]
["Emer Mgmt and Surge Cap","Staff",1,"Total for facility not FTE"]
["Emer Mgmt and Surge Cap","Staff",2,"Total for facility not FTE"]
["Emer Mgmt and Surge Cap","Plan",1,"HVA - see TJC requirements, review and update yearly. Is the HVA shared regionally / within the coalition?","TJC"]
["Emer Mgmt and Surge Cap","Plan",2,"See TJC and other requirements, review/update yearly. Consider accessibility, formatting, base plan and annex utility.","TJC"]
["Emer Mgmt and Surge Cap","Plan",3,"See HICS website for materials. Are command, general, and other supervisory staff adequately trained? Appropriate Job Action Sheets / Job Aids?","HICS weblink"]
["Emer Mgmt and Surge Cap","Plan",4,"Note that this is overall COOP plan, see IT for specific systems failure plans"]
["Emer Mgmt and Surge Cap","Plan",5,"Is the leadership line of succession/authority and delegation to the incident commander detailed in the EOP?"]
["Emer Mgmt and Surge Cap","Plan",6,"Do the key response (ED, medicine, surgery, nursing) and support (lab, blood bank, radiology) have adequate plans, training, and job aids available?"]
["Emer Mgmt and Surge Cap","Plan",7,"Is a fatality disposition/holding process and location described? Is there a community plan for mass fatalities? Is the facility plan consistent with the medical examiner's plan?"]
{"$rows_left_out":396}
{"sheet":"Starting The Process","index":3,"n_rows":78,"n_cols":6,"rows_kept":78,"cut":false,"hidden":true,"merged":[[57,2,57,6],[6,2,6,6],[3,3,3,5],[25,2,25,6]]}
[]
[]
[]
[null,null,null,"Starting The Process"]
[]
[]
[null,null,"Instructions For Use"]
[]
[null,null,null,"Purpose",null,"The Resource Vulnerability Analysis (RVA) provides the healthcare facility information about the adequacy of their resources for incident response as well as gaps and priorities to improve preparedness."]
[]
{"$rows_left_out":69}
{"sheet":"Hospital Information","index":4,"n_rows":29,"n_cols":8,"rows_kept":29,"cut":false,"hidden":true,"merged":[[20,2,20,10],[13,2,13,10],[6,2,6,10],[3,3,3,9]]}
[]
[]
[]
[null,null,null,"Hospital Basic Information"]
[]
[]
[null,null,"Hospital Information"]
[]
[null,null,null,"Hospital Name",null,null,null,"Date (mm/dd/yyyy)"]
[]
{"$rows_left_out":20}
{"sheet":"Summary","index":5,"n_rows":35,"n_cols":8,"rows_kept":35,"cut":false,"hidden":true,"merged":[[3,3,3,7],[6,2,6,8],[19,2,19,8],[26,2,26,8],[31,2,31,8]]}
[]
[]
[]
[null,null,null,"Summary Report"]
[]
[]
[null,null,"Conventional"]
[]
[null,null,null,"Delta of Operational vs Occupied Average Beds",null,null,{"$f":"'Hospital Information'!F27","v":0}]
[]
{"$rows_left_out":26}
{"sheet":"Emer Mgmt and Surge Cap","index":6,"n_rows":113,"n_cols":30,"rows_kept":113,"cut":false,"hidden":false,"merged":[[113,2,113,30],[3,3,3,29],[109,2,109,3],[110,2,110,30],[112,2,112,3],[5,10,5,11],[5,13,5,21],[7,3,7,4],[7,19,7,21],[7,26,7,28],[7,6,7,11]]}
[]
[]
[]
[null,null,null,"Hospital Resource Vulnerability Assessment (RVA) - Emergency Management and Surge Capacity"]
[]
[null,null,null,null,null,null,null,null,null,null,"Hospital:",null,null,{"$f":"IF('Hospital Information'!F9=\"\",\"\",'Hospital Information'!F9)","v":""}]
[]
[null,null,null,"Name of person completing:",null,null,null,null,null,null,null,null,null,"Phone :",null,null,null,"Email:",null,null,null,null,null,null,"Date:",null,null,null,null,"(mm/dd/yyyy)"]
[]
[]
{"$rows_left_out":104}
{"sheet":"Summary Raw","index":7,"n_rows":1,"n_cols":30,"rows_kept":1,"cut":false,"hidden":true,"merged":[]}
["Department","Category","Gap",null,null,"Current",null,"Goal",null,"Goal Sufficient?",null,null,"(L) Likelihood ",null,"(I) Impact",null,"(R) Risk to ",null,"(CP) Current preparedness",null,"(Cost) Cost ",null,null,"Overall Priority ",null,"Priority related to Cost",null,null,"Gap Closure Solution and Notes",2014]

{"sheet":"Critical Care","index":8,"n_rows":46,"n_cols":34,"rows_kept":46,"cut":false,"hidden":false,"merged":[[46,2,46,30],[3,3,3,29],[45,2,45,3],[42,2,42,3],[43,2,43,30],[5,10,5,11],[5,13,5,21],[7,3,7,4],[7,19,7,21],[7,26,7,28],[7,6,7,11]]}
[null,null,null,null,null,null,null,null,null,null,null,null,null,null,null,null,null,null,null,null,null,null,null,null,null,null,null,null,null,null,null,null,null,6]
[]
[]
[null,null,null,"Hospital Resource Vulnerability Assessment (RVA) - Critical Care"]
[]
[null,null,null,null,null,null,null,null,null,null,"Hospital:",null,null,{"$f":"IF('Hospital Information'!F9=\"\",\"\",'Hospital Information'!F9)","v":""}]
[null,null,null," "]
[null,null,null,"Name of person completing:",null,null,null,null,null,null,null,null,null,"Phone:",null,null,null,"Email:",null,null,null,null,null,null,"Date:",null,null,null,null,"(mm/dd/yyyy)"]
[]
[]
{"$rows_left_out":37}
{"sheet":"ED","index":9,"n_rows":92,"n_cols":30,"rows_kept":92,"cut":false,"hidden":false,"merged":[[92,2,92,30],[3,3,3,29],[5,10,5,11],[89,2,89,30],[91,2,91,3],[88,2,88,3],[7,26,7,28],[7,19,7,21],[7,3,7,4],[5,13,5,21],[7,6,7,11]]}
[]
[]
[]
[null,null,null,"Hospital Resource Vulnerability Assessment (RVA) - ED"]
[]
[null,null,null,null,null,null,null,null,null,null,"Hospital:",null,null,{"$f":"IF('Hospital Information'!F9=\"\",\"\",'Hospital Information'!F9)","v":""}]
[]
[null,null,null,"Name of person completing:",null,null,null,null,null,null,null,null,null,"Phone:",null,null,null,"Email:",null,null,null,null,null,null,"Date:",null,null,null,null,"(mm/dd/yyyy)"]
[]
[]
{"$rows_left_out":83}
{"sheet":"Medical Services","index":10,"n_rows":58,"n_cols":30,"rows_kept":58,"cut":false,"hidden":false,"merged":[[54,2,54,3],[55,2,55,30],[57,2,57,3],[58,2,58,30],[3,3,3,29],[5,10,5,11],[5,13,5,21],[7,3,7,4],[7,6,7,11],[7,19,7,21],[7,26,7,28]]}
[]
[]
[]
[null,null,null,"Hospital Resource Vulnerability Assessment (RVA) - Medical Services"]
[]
[null,null,null,null,null,null,null,null,null,null,"Hospital:",null,null,{"$f":"IF('Hospital Information'!F9=\"\",\"\",'Hospital Information'!F9)","v":""}]
[]
[null,null,null,"Name of person completing:",null,null,null,null,null,null,null,null,null,"Phone:",null,null,null,"Email:",null,null,null,null,null,null,"Date:",null,null,null,null,"(mm/dd/yyyy)"]
[]
[]
{"$rows_left_out":49}
{"sheet":"Mental Health","index":11,"n_rows":62,"n_cols":30,"rows_kept":62,"cut":false,"hidden":false,"merged":[[62,2,62,30],[3,3,3,29],[61,2,61,3],[58,2,58,3],[59,2,59,30],[5,10,5,11],[5,13,5,21],[7,3,7,4],[7,19,7,21],[7,26,7,28],[7,6,7,11]]}
[]
[]
[]
[null,null,null,"Hospital Resource Vulnerability Assessment (RVA) - Mental Health"]
[]
[null,null,null,null,null,null,null,null,null,null,"Hospital:",null,null,{"$f":"IF('Hospital Information'!F9=\"\",\"\",'Hospital Information'!F9)","v":""}]
[]
[null,null,null,"Name of person completing:",null,null,null,null,null,null,null,null,null,"Phone:",null,null,null,"Email:",null,null,null,null,null,null,"Date:",null,null,null,null,"(mm/dd/yyyy)"]
[]
[]
{"$rows_left_out":53}
{"sheet":"OBGYN and Nursery","index":12,"n_rows":66,"n_cols":30,"rows_kept":66,"cut":false,"hidden":false,"merged":[[66,2,66,30],[3,3,3,29],[65,2,65,3],[62,2,62,3],[63,2,63,30],[5,10,5,11],[5,13,5,21],[7,3,7,4],[7,19,7,21],[7,26,7,28],[7,6,7,11]]}
[]
[]
[]
[null,null,null,"Hospital Resource Vulnerability Assessment (RVA) - OB/Gyn/Nursery"]
[]
[null,null,null,null,null,null,null,null,null,null,"Hospital:",null,null,{"$f":"IF('Hospital Information'!F9=\"\",\"\",'Hospital Information'!F9)","v":""}]
[]
[null,null,null,"Name of person completing:",null,null,null,null,null,null,null,null,null,"Phone:",null,null,null,"Email:",null,null,null,null,null,null,"Date:",null,null,null,null,"(mm/dd/yyyy)"]
[]
[]
{"$rows_left_out":57}
{"sheet":"Pediatrics","index":13,"n_rows":88,"n_cols":30,"rows_kept":88,"cut":false,"hidden":false,"merged":[[88,2,88,30],[3,3,3,29],[84,2,84,3],[85,2,85,30],[87,2,87,3],[5,10,5,11],[5,13,5,21],[7,3,7,4],[7,19,7,21],[7,26,7,28],[7,6,7,11]]}
[]
[]
[]
[null,null,null,"Hospital Resource Vulnerability Assessment (RVA) - Pediatrics"]
[]
[null,null,null,null,null,null,null,null,null,null,"Hospital:",null,null,{"$f":"IF('Hospital Information'!F9=\"\",\"\",'Hospital Information'!F9)","v":""}]
[]
[null,null,null,"Name of person completing:",null,null,null,null,null,null,null,null,null,"Phone:",null,null,null,"Email:",null,null,null,null,null,null,"Date:",null,null,null,null,"(mm/dd/yyyy)"]
[]
[]
{"$rows_left_out":79}
{"sheet":"Renal","index":14,"n_rows":45,"n_cols":30,"rows_kept":45,"cut":false,"hidden":false,"merged":[[45,2,45,30],[3,3,3,29],[44,2,44,3],[41,2,41,3],[42,2,42,30],[5,10,5,11],[5,13,5,21],[7,3,7,4],[7,19,7,21],[7,26,7,28],[7,6,7,11]]}
[]
[]
[]
[null,null,null,"Hospital Resource Vulnerability Assessment (RVA) - Renal"]
[]
[null,null,null,null,null,null,null,null,null,null,"Hospital:",null,null,{"$f":"IF('Hospital Information'!F9=\"\",\"\",'Hospital Information'!F9)","v":""}]
[]
[null,null,null,"Name of person completing:",null,null,null,null,null,null,null,null,null,"Phone:",null,null,null,"Email:",null,null,null,null,null,null,"Date:",null,null,null,null,"(mm/dd/yyyy)"]
[]
[]
{"$rows_left_out":36}
{"sheet":"Surgical Services","index":15,"n_rows":94,"n_cols":30,"rows_kept":94,"cut":false,"hidden":false,"merged":[[94,2,94,30],[3,3,3,29],[93,2,93,3],[90,2,90,3],[91,2,91,30],[5,10,5,11],[5,13,5,21],[7,3,7,4],[7,19,7,21],[7,26,7,28],[7,6,7,11]]}
[]
[]
[]
[null,null,null,"Hospital Resource Vulnerability Assessment (RVA) - Surgical Services"]
[]
[null,null,null,null,null,null,null,null,null,null,"Hospital:",null,null,{"$f":"IF('Hospital Information'!F9=\"\",\"\",'Hospital Information'!F9)","v":""}]
[]
[null,null,null,"Name of person completing:",null,null,null,null,null,null,null,null,null,"Phone:",null,null,null,"Email:",null,null,null,null,null,null,"Date:",null,null,null,null,"(mm/dd/yyyy)"]
[]
[]
{"$rows_left_out":85}
{"sheet":"Blood Bank","index":16,"n_rows":45,"n_cols":30,"rows_kept":45,"cut":false,"hidden":false,"merged":[[45,2,45,30],[3,3,3,29],[44,2,44,3],[41,2,41,3],[42,2,42,30],[5,10,5,11],[5,13,5,21],[7,3,7,4],[7,19,7,21],[7,26,7,28],[7,6,7,11]]}
[]
[]
[]
[null,null,null,"Hospital Resource Vulnerability Assessment (RVA) - Blood Bank"]
[]
[null,null,null,null,null,null,null,null,null,null,"Hospital:",null,null,{"$f":"IF('Hospital Information'!F9=\"\",\"\",'Hospital Information'!F9)","v":""}]
[]
[null,null,null,"Name of person completing:",null,null,null,null,null,null,null,null,null,"Phone:",null,null,null,"Email:",null,null,null,null,null,null,"Date:",null,null,null,null,"(mm/dd/yyyy)"]
[]
[]
{"$rows_left_out":36}
{"sheet":"Facilities_Utilities","index":17,"n_rows":65,"n_cols":30,"rows_kept":65,"cut":false,"hidden":false,"merged":[[65,2,65,30],[3,3,3,29],[64,2,64,3],[5,10,5,11],[5,13,5,21],[7,3,7,4],[7,19,7,21],[7,26,7,28],[7,6,7,11]]}
[]
[]
[]
[null,null,null,"Hospital Resource Vulnerability Assessment (RVA) - Facilities/Utilities"]
[]
[null,null,null,null,null,null,null,null,null,null,"Hospital:",null,null,{"$f":"IF('Hospital Information'!F9=\"\",\"\",'Hospital Information'!F9)","v":""}]
[]
[null,null,null,"Name of person completing:",null,null,null,null,null,null,null,null,null,"Phone:",null,null,null,"Email:",null,null,null,null,null,null,"Date:",null,null,null,null,"(mm/dd/yyyy)"]
[]
[]
{"$rows_left_out":56}
{"sheet":"Infection Prev and Cont","index":18,"n_rows":56,"n_cols":30,"rows_kept":56,"cut":false,"hidden":false,"merged":[[56,2,56,30],[3,3,3,29],[55,2,55,3],[52,2,52,3],[53,2,53,30],[5,10,5,11],[5,13,5,21],[7,3,7,4],[7,19,7,21],[7,26,7,28],[7,6,7,11]]}
[]
[]
[]
[null,null,null,"Hospital Resource Vulnerability Assessment (RVA) - Infection Prevention and Control"]
[]
[null,null,null,null,null,null,null,null,null,null,"Hospital:",null,null,{"$f":"IF('Hospital Information'!F9=\"\",\"\",'Hospital Information'!F9)","v":""}]
[]
[null,null,null,"Name of person completing:",null,null,null,null,null,null,null,null,null,"Phone:",null,null,null,"Email:",null,null,null,null,null,null,"Date:",null,null,null,null,"(mm/dd/yyyy)"]
[]
[]
{"$rows_left_out":47}
{"sheet":"IT_Communications","index":19,"n_rows":58,"n_cols":30,"rows_kept":58,"cut":false,"hidden":false,"merged":[[58,2,58,30],[3,3,3,29],[57,2,57,3],[54,2,54,3],[55,2,55,30],[5,10,5,11],[5,13,5,21],[7,3,7,4],[7,19,7,21],[7,26,7,28],[7,6,7,11]]}
[]
[]
[]
[null,null,null,"Hospital Resource Vulnerability Assessment (RVA) - IT/Communications"]
[]
[null,null,null,null,null,null,null,null,null,null,"Hospital:",null,null,{"$f":"IF('Hospital Information'!F9=\"\",\"\",'Hospital Information'!F9)","v":""}]
[]
[null,null,null,"Name of person completing:",null,null,null,null,null,null,null,null,null,"Phone:",null,null,null,"Email:",null,null,null,null,null,null,"Date:",null,null,null,null,"(mm/dd/yyyy)"]
[]
[]
{"$rows_left_out":49}
{"sheet":"Lab","index":20,"n_rows":46,"n_cols":30,"rows_kept":46,"cut":false,"hidden":false,"merged":[[46,2,46,30],[3,3,3,29],[45,2,45,3],[42,2,42,3],[43,2,43,30],[5,10,5,11],[5,13,5,21],[7,3,7,4],[7,19,7,21],[7,26,7,28],[7,6,7,11]]}
[]
[]
[]
[null,null,null,"Hospital Resource Vulnerability Assessment (RVA) - Lab"]
[]
[null,null,null,null,null,null,null,null,null,null,"Hospital:",null,null,{"$f":"IF('Hospital Information'!F9=\"\",\"\",'Hospital Information'!F9)","v":""}]
[]
[null,null,null,"Name of person completing:",null,null,null,null,null,null,null,null,null,"Phone:",null,null,null,"Email:",null,null,null,null,null,null,"Date:",null,null,null,null,"(mm/dd/yyyy)"]
[]
[]
{"$rows_left_out":37}
{"sheet":"Nutrition Services","index":21,"n_rows":54,"n_cols":30,"rows_kept":54,"cut":false,"hidden":false,"merged":[[54,2,54,30],[3,3,3,29],[50,2,50,3],[51,2,51,30],[53,2,53,3],[5,10,5,11],[5,13,5,21],[7,3,7,4],[7,19,7,21],[7,26,7,28],[7,6,7,11]]}
[]
[]
[]
[null,null,null,"Hospital Resource Vulnerability Assessment (RVA) - Nutrition Services"]
[]
[null,null,null,null,null,null,null,null,null,null,"Hospital:",null,null,{"$f":"IF('Hospital Information'!F9=\"\",\"\",'Hospital Information'!F9)","v":""}]
[]
[null,null,null,"Name of person completing:",null,null,null,null,null,null,null,null,null,"Phone:",null,null,null,"Email:",null,null,null,null,null,null,"Date:",null,null,null,null,"(mm/dd/yyyy)"]
[]
[]
{"$rows_left_out":45}
{"sheet":"Pharmacy","index":22,"n_rows":63,"n_cols":30,"rows_kept":63,"cut":false,"hidden":false,"merged":[[63,2,63,30],[3,3,3,29],[59,2,59,3],[60,2,60,30],[62,2,62,3],[5,10,5,11],[5,13,5,21],[7,3,7,4],[7,19,7,21],[7,26,7,28],[7,6,7,11]]}
[]
[]
[]
[null,null,null,"Hospital Resource Vulnerability Assessment (RVA) - Pharmacy"]
[]
[null,null,null,null,null,null,null,null,null,null,"Hospital:",null,null,{"$f":"IF('Hospital Information'!F9=\"\",\"\",'Hospital Information'!F9)","v":""}]
[]
[null,null,null,"Name of person completing:",null,null,null,null,null,null,null,null,null,"Phone:",null,null,null,"Email:",null,null,null,null,null,null,"Date:",null,null,null,null,"(mm/dd/yyyy)"]
[]
[]
{"$rows_left_out":54}
{"sheet":"Radiology","index":23,"n_rows":68,"n_cols":30,"rows_kept":68,"cut":false,"hidden":false,"merged":[[68,2,68,30],[3,3,3,29],[64,2,64,3],[65,2,65,30],[67,2,67,3],[5,10,5,11],[5,13,5,21],[7,3,7,4],[7,19,7,21],[7,26,7,28],[7,6,7,11]]}
[]
[]
[]
[null,null,null,"Hospital Resource Vulnerability Assessment (RVA) - Radiology"]
[]
[null,null,null,null,null,null,null,null,null,null,"Hospital:",null,null,{"$f":"IF('Hospital Information'!F9=\"\",\"\",'Hospital Information'!F9)","v":""}]
[]
[null,null,null,"Name of person completing:",null,null,null,null,null,null,null,null,null,"Phone:",null,null,null,"Email:",null,null,null,null,null,null,"Date:",null,null,null,null,"(mm/dd/yyyy)"]
[]
[]
{"$rows_left_out":59}
{"sheet":"Resp Care_Bioelectronics","index":24,"n_rows":54,"n_cols":30,"rows_kept":54,"cut":false,"hidden":false,"merged":[[54,2,54,30],[3,3,3,29],[50,2,50,3],[51,2,51,30],[53,2,53,3],[5,10,5,11],[5,13,5,21],[7,3,7,4],[7,19,7,21],[7,26,7,28],[7,6,7,11]]}
[]
[]
[]
[null,null,null,"Hospital Resource Vulnerability Assessment (RVA) - Respiratory Care/Biolelectronics"]
[]
[null,null,null,null,null,null,null,null,null,null,"Hospital:",null,null,{"$f":"IF('Hospital Information'!F9=\"\",\"\",'Hospital Information'!F9)","v":""}]
[]
[null,null,null,"Name of person completing:",null,null,null,null,null,null,null,null,null,"Phone:",null,null,null,"Email:",null,null,null,null,null,null,"Date:",null,null,null,null,"(mm/dd/yyyy)"]
[]
[]
{"$rows_left_out":45}
{"sheet":"Safety and Security","index":25,"n_rows":67,"n_cols":30,"rows_kept":67,"cut":false,"hidden":false,"merged":[[67,2,67,30],[3,3,3,29],[63,2,63,3],[64,2,64,30],[66,2,66,3],[5,10,5,11],[5,13,5,21],[7,3,7,4],[7,19,7,21],[7,26,7,28],[7,6,7,11]]}
[]
[]
[]
[null,null,null,"Hospital Resource Vulnerability Assessment (RVA) - Safety and Security"]
[]
[null,null,null,null,null,null,null,null,null,null,"Hospital:",null,null,{"$f":"IF('Hospital Information'!F9=\"\",\"\",'Hospital Information'!F9)","v":""}]
[]
[null,null,null,"Name of person completing:",null,null,null,null,null,null,null,null,null,"Phone:",null,null,null,"Email:",null,null,null,null,null,null,"Date:",null,null,null,null,"(mm/dd/yyyy)"]
[]
[]
{"$rows_left_out":58}
{"sheet":"Sterile Supply","index":26,"n_rows":43,"n_cols":30,"rows_kept":43,"cut":false,"hidden":false,"merged":[[43,2,43,30],[3,3,3,29],[39,2,39,3],[40,2,40,30],[42,2,42,3],[5,10,5,11],[5,13,5,21],[7,3,7,4],[7,19,7,21],[7,26,7,28],[7,6,7,11]]}
[]
[]
[]
[null,null,null,"Hospital Resource Vulnerability Assessment (RVA) - Sterile Supply"]
[]
[null,null,null,null,null,null,null,null,null,null,"Hospital:",null,null,{"$f":"IF('Hospital Information'!F9=\"\",\"\",'Hospital Information'!F9)","v":""}]
[]
[null,null,null,"Name of person completing:",null,null,null,null,null,null,null,null,null,"Phone:",null,null,null,"Email:",null,null,null,null,null,null,"Date:",null,null,null,null,"(mm/dd/yyyy)"]
[]
[]
{"$rows_left_out":34}
{"sheet":"Storeroom","index":27,"n_rows":47,"n_cols":30,"rows_kept":47,"cut":false,"hidden":false,"merged":[[47,2,47,30],[43,2,43,3],[44,2,44,30],[46,2,46,3],[7,6,7,11],[3,3,3,29],[5,10,5,11],[5,13,5,21],[7,3,7,4],[7,19,7,21],[7,26,7,28]]}
[]
[]
[]
[null,null,null,"Hospital Resource Vulnerability Assessment (RVA) - Storeroom"]
[]
[null,null,null,null,null,null,null,null,null,null,"Hospital:",null,null,{"$f":"IF('Hospital Information'!F9=\"\",\"\",'Hospital Information'!F9)","v":""}]
[]
[null,null,null,"Name of person completing:",null,null,null,null,null,null,null,null,null,"Phone:",null,null,null,"Email:",null,null,null,null,null,null,"Date:",null,null,null,null,"(mm/dd/yyyy)"]
[]
[]
{"$rows_left_out":38}
{"sheet":"Transportation","index":28,"n_rows":33,"n_cols":30,"rows_kept":33,"cut":false,"hidden":false,"merged":[[33,2,33,30],[29,2,29,3],[30,2,30,30],[32,2,32,3],[7,6,7,11],[3,3,3,29],[5,10,5,11],[5,13,5,21],[7,3,7,4],[7,19,7,21],[7,26,7,28]]}
[]
[]
[]
[null,null,null,"Hospital Resource Vulnerability Assessment (RVA) - Transportation"]
[]
[null,null,null,null,null,null,null,null,null,null,"Hospital:",null,null,{"$f":"IF('Hospital Information'!F9=\"\",\"\",'Hospital Information'!F9)","v":""}]
[]
[null,null,null,"Name of person completing:",null,null,null,null,null,null,null,null,null,"Phone:",null,null,null,"Email:",null,null,null,null,null,null,"Date:",null,null,null,null,"(mm/dd/yyyy)"]
[]
[]
{"$rows_left_out":24}
{"sheet":"Pharmacy Supplies","index":29,"n_rows":102,"n_cols":7,"rows_kept":102,"cut":false,"hidden":true,"merged":[[0,0,0,6]]}
["HPP Disaster Resource Vulnerability Analysis - Pharmacy Worksheet"]
["Category","Pharmacy tracking / stock number","Quantity available on: (date surveyed)","Duration by avg use (month supply)","Goal","Cost","Comments"]
["Analgesia"]
["MS 10mg / 2mL injectable"]
["Hydromorphone 2mg/2mL injectable"]
["Fentanyl 100mcg/2mL"]
["MS 100mg?"]
["Other forms/concentrations?"]
["Oxycodone 10mg/15mL"]
["Norco tabs"]
{"$rows_left_out":93}
{"sheet":"Storeroom Supplies","index":30,"n_rows":89,"n_cols":7,"rows_kept":89,"cut":false,"hidden":true,"merged":[[0,0,0,6]]}
["HCMC Departmental Disaster Resource Vulnerability Analysis - Storeroom Worksheet"]
["Category","Pharmacy tracking / stock number","Quantity available on: (date surveyed)","Duration by avg use (month supply)","Goal","Cost","Comments"]
["Disaster cart (stocked for ED)"]
["See separate list - does not affect par - consider cart for SPC also?"]
[]
["Burn Supplies (#)"]
["Adaptic 8x18"]
["Kerlix roll 4 inch"]
["Kerlix roll 2 inch"]
[]
{"$rows_left_out":80}
{"sheet":"Codes","index":31,"n_rows":12,"n_cols":27,"rows_kept":12,"cut":false,"hidden":true,"merged":[]}
["Likelihood","Impact","Risk","Current Preparedness","Cost","Goal Sufficient","Trauma Level"]
["[Select]","[Select]","[Select]","[Select]","[Select]","[Select]","[Select]"]
["1 - Unlikely","1 - Few persons","1 - Low risk","1 - Prepared","1 - < $10,000","Yes",1]
["2 - Possible","2 - Multiple persons","2 - Medium risk","2 - Somewhat","2 - $10,000 - $50,000","No",2]
["3 - Likely","3 - Hospital-wide","3 - High risk","3 - Least","3 - > $50,000","N/A",3]
[null,null,null,null,null,null,4]
[]
[]
[]
[]
{"$rows_left_out":2}